Target
Vascular endothelial growth factor receptor 2
Ligand
BDBM50232192
Substrate
Meas. Tech.
ChEMBL_1646127 (CHEMBL3995183)
IC50
19±n/a nM
Citation
 Cherukupalli, SKarpoormath, RChandrasekaran, BHampannavar, GAThapliyal, NPalakollu, VN An insight on synthetic and medicinal aspects of pyrazolo[1,5-a]pyrimidine scaffold. Eur J Med Chem 126:298-352 (2017)  
Target
Name:
Vascular endothelial growth factor receptor 2
Synonyms:
CD_antigen=CD309 Fetal liver kinase 1 (FLK-1) KDR Protein-tyrosine kinase receptor Flk-1 VEGFR-2 VEGFR2 Vascular Endothelial Growth Factor Receptor Kinase 2 Vascular endothelial growth factor receptor 2 (KDR) Vascular endothelial growth factor receptor 2 (VEGFR2) Vascular endothelial growth factor receptor-2 (VEGFR-2)
Type:
Receptor Tyrosine Kinase
Mol. Mass.:
151510.97
Organism:
Homo sapiens (Human)
Description:
P35968
Residue:
1356
  
Inhibitor
Name:
BDBM50232192
Synonyms:
CHEMBL4082186
Type:
Small organic molecule
Emp. Form.:
C17H13N3OS
Mol. Mass.:
307.37
SMILES:
COc1ccc(cc1)-c1cnn2cc(cnc12)-c1ccsc1
: