Target
Retinoic acid receptor RXR-alpha
Ligand
BDBM50371229
Substrate
Meas. Tech.
ChEMBL_1649602 (CHEMBL3998736)
Kd
13300±n/a nM
Citation
 Xu, DCai, LGuo, SXie, LYin, MChen, ZZhou, HSu, YZeng, ZZhang, X Virtual screening and experimental validation identify novel modulators of nuclear receptor RXRa from Drugbank database. Bioorg Med Chem Lett 27:1055-1061 (2017)  
Target
Name:
Retinoic acid receptor RXR-alpha
Synonyms:
NR2B1 Nuclear receptor subfamily 4 group A member 2 RXRA Retinoic acid receptor RXR-alpha/gamma Retinoid receptor
Type:
PROTEIN
Mol. Mass.:
50820.38
Organism:
Homo sapiens (Human)
Description:
ChEMBL_1456363
Residue:
462
  
Inhibitor
Name:
BDBM50371229
Synonyms:
Livalo cid_24848419
Type:
Small organic molecule
Emp. Form.:
C25H23FNO4
Mol. Mass.:
420.4534
SMILES:
O[C@H](C[C@H](O)\C=C\c1c(nc2ccccc2c1-c1ccc(F)cc1)C1CC1)CC([O-])=O
: