Target
Cytosolic phospholipase A2
Ligand
BDBM50233832
Substrate
Meas. Tech.
ChEMBL_1651523 (CHEMBL4000778)
IC50
10±n/a nM
Citation
 Arnsmann, MHanekamp, WElfringhoff, ASLehr, M Structure-activity relationship studies on 1-(2-oxopropyl)indole-5-carboxylic acids acting as inhibitors of cytosolic phospholipase A Eur J Med Chem 125:1107-1114 (2017)  
Target
Name:
Cytosolic phospholipase A2
Synonyms:
CPLA2 PA24A_HUMAN PLA2G4A Phospholipase A2 | Phospholipase A2 group IVA
Type:
Protein
Mol. Mass.:
85219.30
Organism:
Homo sapiens (Human)
Description:
P47712
Residue:
749
  
Inhibitor
Name:
BDBM50233832
Synonyms:
CHEMBL1800991
Type:
Small organic molecule
Emp. Form.:
C30H37NO5
Mol. Mass.:
491.6185
SMILES:
CCCCCCCCc1ccc(OCC(=O)Cn2cc(C(=O)CCC)c3cc(ccc23)C(O)=O)cc1
: