Target
ATP-citrate synthase
Ligand
BDBM50234012
Substrate
Meas. Tech.
ChEMBL_1651959 (CHEMBL4001214)
IC50
13300±n/a nM
Citation
 Koerner, SKHanai, JIBai, SJernigan, FEOki, MKomaba, CShuto, ESukhatme, VPSun, L Design and synthesis of emodin derivatives as novel inhibitors of ATP-citrate lyase. Eur J Med Chem 126:920-928 (2017)  
Target
Name:
ATP-citrate synthase
Synonyms:
ACLY | ACLY_HUMAN
Type:
PROTEIN
Mol. Mass.:
120848.43
Organism:
Homo sapiens (Human)
Description:
ChEMBL_455196
Residue:
1101
  
Inhibitor
Name:
BDBM50234012
Synonyms:
CHEMBL4062121
Type:
Small organic molecule
Emp. Form.:
C19H14N2O5
Mol. Mass.:
350.3249
SMILES:
Cc1cc(O)c2C(=O)c3c(O)c(-c4cnn(C)c4)c(O)cc3C(=O)c2c1
: