Target
ATP-citrate synthase
Ligand
BDBM50209010
Substrate
Meas. Tech.
ChEMBL_1651959 (CHEMBL4001214)
IC50
442±n/a nM
Citation
 Koerner, SKHanai, JIBai, SJernigan, FEOki, MKomaba, CShuto, ESukhatme, VPSun, L Design and synthesis of emodin derivatives as novel inhibitors of ATP-citrate lyase. Eur J Med Chem 126:920-928 (2017)  
Target
Name:
ATP-citrate synthase
Synonyms:
ACLY | ACLY_HUMAN
Type:
PROTEIN
Mol. Mass.:
120848.43
Organism:
Homo sapiens (Human)
Description:
ChEMBL_455196
Residue:
1101
  
Inhibitor
Name:
BDBM50209010
Synonyms:
3,5-dichloro-2-hydroxy-N-(4-methoxy-biphenyl-3-yl)-benzenesulfonamide | CHEMBL399379
Type:
Small organic molecule
Emp. Form.:
C19H15Cl2NO4S
Mol. Mass.:
424.298
SMILES:
COc1ccc(cc1NS(=O)(=O)c1cc(Cl)cc(Cl)c1O)-c1ccccc1
: