Target
Heat shock factor protein 1
Ligand
BDBM50234084
Substrate
Meas. Tech.
ChEMBL_1652055 (CHEMBL4001310)
IC50
>10000±n/a nM
Citation
 Cheeseman, MDChessum, NERye, CSPasqua, AETucker, MJWilding, BEvans, LELepri, SRichards, MSharp, SYAli, SRowlands, MO'Fee, LMiah, AHayes, AHenley, ATPowers, MTe Poele, RDe Billy, EPellegrino, LRaynaud, FBurke, Rvan Montfort, RLEccles, SAWorkman, PJones, K Discovery of a Chemical Probe Bisamide (CCT251236): An Orally Bioavailable Efficacious Pirin Ligand from a Heat Shock Transcription Factor 1 (HSF1) Phenotypic Screen. J Med Chem 60:180-201 (2017)  
Target
Name:
Heat shock factor protein 1
Synonyms:
HSF1 HSTF1
Type:
PROTEIN
Mol. Mass.:
57244.20
Organism:
Homo sapiens (Human)
Description:
ChEMBL_1512556
Residue:
529
  
Inhibitor
Name:
BDBM50234084
Synonyms:
CHEMBL4091953
Type:
Small organic molecule
Emp. Form.:
C32H32N4O5
Mol. Mass.:
552.6203
SMILES:
Cc1ccc(NC(=O)c2cccc3OCCOc23)cc1NC(=O)c1ccc2nc(OCCN3CCCC3)ccc2c1
: