Target
Tyrosine-protein kinase JAK1
Ligand
BDBM50234901
Substrate
Meas. Tech.
ChEMBL_1654088 (CHEMBL4003454)
IC50
27±n/a nM
Citation
 Jones, PStorer, RISabnis, YAWakenhut, FMWhitlock, GAEngland, KSMukaiyama, TDehnhardt, CMCoe, JWKortum, SWChrencik, JEBrown, DGJones, RMMurphy, JRYeoh, TMorgan, PKilty, I Design and Synthesis of a Pan-Janus Kinase Inhibitor Clinical Candidate (PF-06263276) Suitable for Inhaled and Topical Delivery for the Treatment of Inflammatory Diseases of the Lungs and Skin. J Med Chem 60:767-786 (2017)  
Target
Name:
Tyrosine-protein kinase JAK1
Synonyms:
JAK-1 JAK1A JAK1_HUMAN Janus kinase 1 (JAK1) | Janus kinase 1 JAK1
Type:
Protein
Mol. Mass.:
133293.73
Organism:
Homo sapiens (Human)
Description:
P23458
Residue:
1154
  
Inhibitor
Name:
BDBM50234901
Synonyms:
CHEMBL4087076
Type:
Small organic molecule
Emp. Form.:
C23H20N4O
Mol. Mass.:
368.4311
SMILES:
CC(C)c1cc(O)ccc1-c1ccc2c(n[nH]c2c1)-c1nc2ccccc2[nH]1
: