Target
Non-receptor tyrosine-protein kinase TYK2
Ligand
BDBM50234909
Substrate
Meas. Tech.
ChEMBL_1654084 (CHEMBL4003450)
IC50
25±n/a nM
Citation
 Jones, PStorer, RISabnis, YAWakenhut, FMWhitlock, GAEngland, KSMukaiyama, TDehnhardt, CMCoe, JWKortum, SWChrencik, JEBrown, DGJones, RMMurphy, JRYeoh, TMorgan, PKilty, I Design and Synthesis of a Pan-Janus Kinase Inhibitor Clinical Candidate (PF-06263276) Suitable for Inhaled and Topical Delivery for the Treatment of Inflammatory Diseases of the Lungs and Skin. J Med Chem 60:767-786 (2017)  
Target
Name:
Non-receptor tyrosine-protein kinase TYK2
Synonyms:
Non-receptor tyrosine-protein kinase TYK2 (TYK2) TYK2_HUMAN | Tyrosine-protein kinase TYK2
Type:
Protein
Mol. Mass.:
133666.03
Organism:
Homo sapiens (Human)
Description:
P29597
Residue:
1187
  
Inhibitor
Name:
BDBM50234909
Synonyms:
CHEMBL4069951
Type:
Small organic molecule
Emp. Form.:
C22H23N5O3S
Mol. Mass.:
437.515
SMILES:
CCc1cc(O)ccc1-c1ccc2c(n[nH]c2c1)-c1nc2CCN(Cc2[nH]1)S(C)(=O)=O
: