Target
Nuclear receptor ROR-beta
Ligand
BDBM50235603
Substrate
Meas. Tech.
ChEMBL_1657625 (CHEMBL4007095)
IC50
12400±n/a nM
Citation
 Nefzi, AMarconi, GDOrtiz, MADavis, JCPiedrafita, FJ Synthesis of dihydroimidazole tethered imidazolinethiones and their activity as novel antagonists of the nuclear retinoic acid receptor-related orphan receptors (RORs). Bioorg Med Chem Lett 27:1608-1610 (2017)  
Target
Name:
Nuclear receptor ROR-beta
Synonyms:
Nr1f2 Nuclear receptor RZR-beta RORB_RAT Rorb | Rzrb
Type:
PROTEIN
Mol. Mass.:
53208.80
Organism:
Rattus norvegicus
Description:
ChEMBL_117326
Residue:
470
  
Inhibitor
Name:
BDBM50235603
Synonyms:
CHEMBL4091239
Type:
Small organic molecule
Emp. Form.:
C32H37FN4S
Mol. Mass.:
528.726
SMILES:
Fc1ccc(CC2=N[C@@H](CCCCN3C[C@H](Cc4ccccc4)N(CCc4ccccc4)C3=S)CN2)cc1
: