Target
Nuclear receptor ROR-gamma
Ligand
BDBM50235608
Substrate
Meas. Tech.
ChEMBL_1657623 (CHEMBL4007093)
IC50
5600±n/a nM
Citation
 Nefzi, AMarconi, GDOrtiz, MADavis, JCPiedrafita, FJ Synthesis of dihydroimidazole tethered imidazolinethiones and their activity as novel antagonists of the nuclear retinoic acid receptor-related orphan receptors (RORs). Bioorg Med Chem Lett 27:1608-1610 (2017)  
Target
Name:
Nuclear receptor ROR-gamma
Synonyms:
Nr1f3 Nuclear receptor subfamily 1 group F member 3 RORG_MOUSE Rorc TOR Thymus orphan receptor
Type:
PROTEIN
Mol. Mass.:
58133.31
Organism:
Mus musculus
Description:
ChEMBL_103664
Residue:
516
  
Inhibitor
Name:
BDBM50235608
Synonyms:
CHEMBL4067306
Type:
Small organic molecule
Emp. Form.:
C32H44N4S
Mol. Mass.:
516.784
SMILES:
S=C1N(CCCC[C@H]2CNC(CCC3CCCC3)=N2)C[C@H](Cc2ccccc2)N1CCc1ccccc1
: