Target
Nuclear receptor ROR-gamma
Ligand
BDBM50235618
Substrate
Meas. Tech.
ChEMBL_1657623 (CHEMBL4007093)
IC50
10200±n/a nM
Citation
 Nefzi, AMarconi, GDOrtiz, MADavis, JCPiedrafita, FJ Synthesis of dihydroimidazole tethered imidazolinethiones and their activity as novel antagonists of the nuclear retinoic acid receptor-related orphan receptors (RORs). Bioorg Med Chem Lett 27:1608-1610 (2017)  
Target
Name:
Nuclear receptor ROR-gamma
Synonyms:
Nr1f3 Nuclear receptor subfamily 1 group F member 3 RORG_MOUSE Rorc TOR Thymus orphan receptor
Type:
PROTEIN
Mol. Mass.:
58133.31
Organism:
Mus musculus
Description:
ChEMBL_103664
Residue:
516
  
Inhibitor
Name:
BDBM50235618
Synonyms:
CHEMBL4093723
Type:
Small organic molecule
Emp. Form.:
C25H40N4S
Mol. Mass.:
428.677
SMILES:
CCCC[C@H]1CN(CCCC[C@H]2CNC(CCC)=N2)C(=S)N1CCc1ccccc1
: