Target
Nuclear receptor ROR-alpha
Ligand
BDBM50235620
Substrate
Meas. Tech.
ChEMBL_1657624 (CHEMBL4007094)
IC50
6800±n/a nM
Citation
 Nefzi, AMarconi, GDOrtiz, MADavis, JCPiedrafita, FJ Synthesis of dihydroimidazole tethered imidazolinethiones and their activity as novel antagonists of the nuclear retinoic acid receptor-related orphan receptors (RORs). Bioorg Med Chem Lett 27:1608-1610 (2017)  
Target
Name:
Nuclear receptor ROR-alpha
Synonyms:
NR1F1 Nuclear receptor subfamily 1 group F member 1 RORA RZRA | Retinoid-related orphan receptor-alpha
Type:
PROTEIN
Mol. Mass.:
58976.26
Organism:
Homo sapiens (Human)
Description:
ChEMBL_101591
Residue:
523
  
Inhibitor
Name:
BDBM50235620
Synonyms:
CHEMBL4063381
Type:
Small organic molecule
Emp. Form.:
C32H37FN4S
Mol. Mass.:
528.726
SMILES:
Fc1cccc(CC2=N[C@@H](CCCCN3C[C@H](Cc4ccccc4)N(CCc4ccccc4)C3=S)CN2)c1
: