Target
P2Y purinoceptor 4
Ligand
BDBM50029031
Substrate
Meas. Tech.
ChEMBL_1661636 (CHEMBL4011248)
IC50
1140±n/a nM
Citation
 Rafehi, MMalik, EMNeumann, AAbdelrahman, AHanck, TNamasivayam, VMüller, CEBaqi, Y Development of Potent and Selective Antagonists for the UTP-Activated P2Y J Med Chem 60:3020-3038 (2017)  
Target
Name:
P2Y purinoceptor 4
Synonyms:
NRU P2RY4 P2Y purinoceptor 4 Pyrimidinergic receptor P2Y4 Uridine nucleotide receptor
Type:
PROTEIN
Mol. Mass.:
40977.17
Organism:
Homo sapiens (Human)
Description:
ChEMBL_751027
Residue:
365
  
Inhibitor
Name:
BDBM50029031
Synonyms:
1-Amino-4-{4-[4-chloro-6-(3-sulfo-phenylamino)-[1,3,5]triazin-2-ylamino]-3-sulfo-phenylamino}-9,10-dioxo-9,10-dihydro-anthracene-2-sulfonic acid1-Amino-4-{4-[4-chloro-6-(4-sulfo-phenylamino)-[1,3,5]triazin-2-ylamino]-3-sulfo-phenylamino}-9,10-dioxo-9,10-dihydro-anthracene-2-sulfonic acid CID44285648 cibacron blue (mixer, meta and para isomers
Type:
Small organic molecule
Emp. Form.:
C29H17ClN7O11S3
Mol. Mass.:
771.135
SMILES:
Nc1c(cc(Nc2ccc(Nc3nc(Cl)nc(Nc4cccc(c4)S([O-])(=O)=O)n3)c(c2)S([O-])(=O)=O)c2C(=O)c3ccccc3C(=O)c12)S([O-])(=O)=O
: