Target
Bile salt export pump
Ligand
BDBM50237609
Substrate
Meas. Tech.
ChEMBL_1661982 (CHEMBL4011663)
IC50
>135000±n/a nM
Citation
 Morgan, RETrauner, Mvan Staden, CJLee, PHRamachandran, BEschenberg, MAfshari, CAQualls, CWLightfoot-Dunn, RHamadeh, HK Interference with bile salt export pump function is a susceptibility factor for human liver injury in drug development. Toxicol Sci 118:485-500 (2010)  
Target
Name:
Bile salt export pump
Synonyms:
ABCB11 ATP-binding cassette sub-family B member 11 Bile Salt Export Pump, BSEP Bile salt export pump (BSEP)
Type:
Protein
Mol. Mass.:
146405.49
Organism:
Homo sapiens (Human)
Description:
O95342
Residue:
1321
  
Inhibitor
Name:
BDBM50237609
Synonyms:
CHEBI:6900 Metocurine
Type:
Small organic molecule
Emp. Form.:
C40H48N2O6
Mol. Mass.:
652.8178
SMILES:
[H][C@]12Cc3ccc(Oc4c(OC)c(OC)cc5CC[N+](C)(C)[C@]([H])(Cc6ccc(OC)c(Oc7cc1c(CC[N+]2(C)C)cc7OC)c6)c45)cc3
: