Target
Bile salt export pump
Ligand
BDBM25769
Substrate
Meas. Tech.
ChEMBL_1661989 (CHEMBL4011670)
IC50
>1000000±n/a nM
Citation
 Aleo, MDLuo, YSwiss, RBonin, PDPotter, DMWill, Y Human drug-induced liver injury severity is highly associated with dual inhibition of liver mitochondrial function and bile salt export pump. Hepatology 60:1015-22 (2014)  
Target
Name:
Bile salt export pump
Synonyms:
ABCB11 ATP-binding cassette sub-family B member 11 Bile Salt Export Pump, BSEP Bile salt export pump (BSEP)
Type:
Protein
Mol. Mass.:
146405.49
Organism:
Homo sapiens (Human)
Description:
O95342
Residue:
1321
  
Inhibitor
Name:
BDBM25769
Synonyms:
4-[2-(tert-butylamino)-1-hydroxyethyl]-2-(hydroxymethyl)phenol Proventil Salbutamol,(+/-) | albuterol
Type:
Small organic molecule
Emp. Form.:
C13H21NO3
Mol. Mass.:
239.3107
SMILES:
CC(C)(C)NCC(O)c1ccc(O)c(CO)c1
: