Target
D(2) dopamine receptor
Ligand
BDBM22871
Substrate
Ki
8±n/a nM
Comments
PDSP_1090
Citation
 Roth, BLTandra, SBurgess, LHSibley, DRMeltzer, HY D4 dopamine receptor binding affinity does not distinguish between typical and atypical antipsychotic drugs. Psychopharmacology (Berl) 120:365-8 (1995)  
Target
Name:
D(2) dopamine receptor
Synonyms:
DOPAMINE D2 DOPAMINE D2 Short Dopamine D2 receptor Drd2
Type:
G Protein-Coupled Receptor (GPCR)
Mol. Mass.:
50931.60
Organism:
Rattus norvegicus (rat)
Description:
P61169
Residue:
444
  
Inhibitor
Name:
BDBM22871
Synonyms:
13-chloro-10-(4-methylpiperazin-1-yl)-2-oxa-9-azatricyclo[9.4.0.0^{3,8}]pentadeca-1(11),3,5,7,9,12,14-heptaene 8-chloro-6-(4-methylpiperazino)benzo[b][1,4]benzoxazepine;succinic acid CL71,563 Loxapine
Type:
Small organic molecule
Emp. Form.:
C18H18ClN3O
Mol. Mass.:
327.808
SMILES:
CN1CCN(CC1)C1=Nc2ccccc2Oc2ccc(Cl)cc12
: