Target
5-hydroxytryptamine receptor 4
Ligand
BDBM50005836
Substrate
Ki
51.28±n/a nM
Comments
PDSP_530
Citation
 Ansanay, HSebben, MBockaert, JDumuis, A Pharmacological comparison between [3H]GR 113808 binding sites and functional 5-HT4 receptors in neurons. Eur J Pharmacol 298:165-74 (1996)  
Target
Name:
5-hydroxytryptamine receptor 4
Synonyms:
5-HT-4 5-HT4L 5HT4R_MOUSE Serotonin 4 (5-HT4) receptor | Serotonin receptor 4
Type:
Enzyme Catalytic Domain
Mol. Mass.:
43970.99
Organism:
MOUSE
Description:
5-HT4 HTR4 MOUSE::P97288
Residue:
388
  
Inhibitor
Name:
BDBM50005836
Synonyms:
4-Amino-5-chloro-N-{1-[3-(4-fluoro-phenoxy)-propyl]-3-methoxy-piperidin-4-yl}-2-methoxy-benzamide CHEMBL560739 PROPULSID US10800776, Example Cisapride cid_5311047
Type:
Small organic molecule
Emp. Form.:
C23H29ClFN3O4
Mol. Mass.:
465.945
SMILES:
COC1CN(CCCOc2ccc(F)cc2)CCC1NC(=O)c1cc(Cl)c(N)cc1OC
: