Target
5-hydroxytryptamine receptor 4
Ligand
BDBM50007872
Substrate
Ki
53.7±n/a nM
Comments
PDSP_399
Citation
 Claeysen, SSebben, MJournot, LBockaert, JDumuis, A Cloning, expression and pharmacology of the mouse 5-HT(4L) receptor. FEBS Lett 398:19-25 (1996)  
Target
Name:
5-hydroxytryptamine receptor 4
Synonyms:
5-HT-4 5-HT4L 5HT4R_MOUSE Serotonin 4 (5-HT4) receptor | Serotonin receptor 4
Type:
Enzyme Catalytic Domain
Mol. Mass.:
43970.99
Organism:
MOUSE
Description:
5-HT4 HTR4 MOUSE::P97288
Residue:
388
  
Inhibitor
Name:
BDBM50007872
Synonyms:
3-Ethyl-2-oxo-2,3-dihydro-benzoimidazole-1-carboxylic acid (8-methyl-8-aza-bicyclo[3.2.1]oct-3-yl)-amide; hydrochloride CHEMBL544755 | CHEMBL62023
Type:
Small organic molecule
Emp. Form.:
C18H24N4O2
Mol. Mass.:
328.4088
SMILES:
CCn1c2ccccc2n(C(=O)NC2CC3CCC(C2)N3C)c1=O
: