Target
5-hydroxytryptamine receptor 1A
Ligand
BDBM50280934
Substrate
Ki
6.7±n/a nM
Comments
PDSP_1803
Citation
 Lejeune, FNewman-Tancredi, AAudinot, VMillan, MJ Interactions of (+)- and (-)-8- and 7-hydroxy-2-(di-n-propylamino)tetralin at human (h)D3, hD2 and h serotonin1A receptors and their modulation of the activity of serotoninergic and dopaminergic neurones in rats. J Pharmacol Exp Ther 280:1241-9 (1997) Target
Name:
5-hydroxytryptamine receptor 1A
Synonyms:
5-HT-1A 5-hydroxytryptamine receptor 1A (5-HT-1A) ADRB2RL1 Dopamine D2 receptor and serotonin 1a receptor HTR1A | Serotonin receptor 1A
Type:
Mol. Mass.:
46122.49
Organism:
Homo sapiens (Human)
Description:
Residue:
422
  
Inhibitor
Name:
BDBM50280934
Synonyms:
1-tert-Butylamino-3-(thiochroman-8-yloxy)-propan-2-ol CHEMBL434200 Tertatolol
Type:
Small organic molecule
Emp. Form.:
C16H25NO2S
Mol. Mass.:
295.44
SMILES:
CC(C)(C)NCC(O)COc1cccc2CCCSc12
: