Target
CB1 cannabinoid receptor-interacting protein 1
Ligand
BDBM17657
Substrate
Ki
1000±n/a nM
Comments
PDSP_873
Citation
 Stefano, GBSalzet, BSalzet, M Identification and characterization of the leech CNS cannabinoid receptor: coupling to nitric oxide release. Brain Res 753:219-24 (1997)  
Target
Name:
CB1 cannabinoid receptor-interacting protein 1
Synonyms:
CANNABINOID CB1 | CNR1
Type:
Enzyme Catalytic Domain
Mol. Mass.:
22425.67
Organism:
theromyzon Tessulatum
Description:
CANNABINOID CB1 CNR1 theromyzon Tessulatum::A0A0V1DID4
Residue:
196
  
Inhibitor
Name:
BDBM17657
Synonyms:
(2S)-2-aminopentanedioic acid D-Glutamate L-Glu L-Glutamic acid L-gluatmate
Type:
Amino Acid
Emp. Form.:
C5H9NO4
Mol. Mass.:
147.1293
SMILES:
N[C@@H](CCC(O)=O)C(O)=O
: