Target
Norepinephrine transporter
Ligand
BDBM35229
Substrate
Ki
40±n/a nM
Comments
PDSP_638
Citation
 Garreau, LEmond, PBelzung, CGuilloteau, DFrangin, YBesnard, JCChalon, S N-(3-lodoprop-2E-enyl)-2beta-carbomethoxy-3beta-(3',4'-dichloro phenyl)nortropane (beta-CDIT), a tropane derivative: pharmacological characterization as a specific ligand for the dopamine transporter in the rodent brain. J Pharmacol Exp Ther 282:467-74 (1997) Target
Name:
Norepinephrine transporter
Synonyms:
Type:
Enzyme Catalytic Domain
Mol. Mass.:
2082.45
Organism:
RAT
Description:
Norepinephrine transporter 0 RAT::Q9JIA2
Residue:
19
MLLARMKPQVQPELGGADQ
  
Inhibitor
Name:
BDBM35229
Synonyms:
3-(10,11-dihydro-5H-dibenzo[b,f]azepin-5-yl)-N-methylpropan-1-amine CHEMBL72 DMI Desipramine N-(3-methylaminopropyl)iminobibenzyl demethylimipramine norimipramine
Type:
Small organic molecule
Emp. Form.:
C18H22N2
Mol. Mass.:
266.3807
SMILES:
CNCCCN1c2ccccc2CCc2ccccc12
: