Target
D(2) dopamine receptor
Ligand
BDBM85097
Substrate
Ki
630.95±n/a nM
Comments
PDSP_1670
Citation
 Kennett, GAWood, MDBright, FTrail, BRiley, GHolland, VAvenell, KYStean, TUpton, NBromidge, SForbes, ITBrown, AMMiddlemiss, DNBlackburn, TP SB 242084, a selective and brain penetrant 5-HT2C receptor antagonist. Neuropharmacology 36:609-20 (1997)  
Target
Name:
D(2) dopamine receptor
Synonyms:
DOPAMINE D2 Dopamine D2 receptor
Type:
Enzyme Catalytic Domain
Mol. Mass.:
50815.48
Organism:
C.H.O.
Description:
A0A1U7QAF5
Residue:
444
  
Inhibitor
Name:
BDBM85097
Synonyms:
CAS_181632-25-7 SB 242084
Type:
Small organic molecule
Emp. Form.:
C21H19ClN4O2
Mol. Mass.:
394.854
SMILES:
Cc1cc2CCN(C(=O)Nc3ccc(Oc4cccnc4C)nc3)c2cc1Cl
: