Target
Prostaglandin E2 receptor EP1 subtype
Ligand
BDBM50020300
Substrate
Ki
1300±n/a nM
Comments
PDSP_1467
Citation
 Kiriyama, MUshikubi, FKobayashi, THirata, MSugimoto, YNarumiya, S Ligand binding specificities of the eight types and subtypes of the mouse prostanoid receptors expressed in Chinese hamster ovary cells. Br J Pharmacol 122:217-24 (1997)  
Target
Name:
Prostaglandin E2 receptor EP1 subtype
Synonyms:
PE2R1_MOUSE Prostaglandin E1 Prostanoid EP1 receptor Ptgerep1
Type:
G-protein coupled receptor
Mol. Mass.:
43000.62
Organism:
Mus musculus (Mouse)
Description:
Residue:
405
  
Inhibitor
Name:
BDBM50020300
Synonyms:
(S-isomer)7-[3,5-Dihydroxy-2-(3-hydroxy-oct-1-enyl)-cyclopentyl]-hept-5-enoic acid 7-[3,5-Dihydroxy-2-(3-hydroxy-oct-1-enyl)-cyclopentyl]-hept-5-enoic acid PGF2Alpha | Prostaglandin F2alpha7-[3,5-Dihydroxy-2-(3-hydroxy-oct-1-enyl)-cyclopentyl]-hept-5-enoic acid
Type:
Small organic molecule
Emp. Form.:
C20H34O5
Mol. Mass.:
354.481
SMILES:
CCCCC[C@H](O)\C=C\C1[C@H](O)C[C@H](O)[C@@H]1C\C=C/CCCC(O)=O
: