Target
Prostacyclin receptor
Ligand
BDBM85179
Substrate
Ki
10±n/a nM
Comments
PDSP_518
Citation
 Kiriyama, MUshikubi, FKobayashi, THirata, MSugimoto, YNarumiya, S Ligand binding specificities of the eight types and subtypes of the mouse prostanoid receptors expressed in Chinese hamster ovary cells. Br J Pharmacol 122:217-24 (1997)  
Target
Name:
Prostacyclin receptor
Synonyms:
PI2R_MOUSE Prostaglandin I Ptgir
Type:
Enzyme Catalytic Domain
Mol. Mass.:
44475.65
Organism:
MOUSE
Description:
Prostaglandin I2 PTGIR MOUSE::P43252
Residue:
415
  
Inhibitor
Name:
BDBM85179
Synonyms:
CAS_94079-80-8 NSC_72023
Type:
Small organic molecule
Emp. Form.:
C22H30O5
Mol. Mass.:
374.4706
SMILES:
CCC#CCC(C)C(O)C#CC1C(O)CC2CC(CC12)=CCOCC(O)=O
: