Target
Prostacyclin receptor
Ligand
BDBM23954
Substrate
Ki
11±n/a nM
Comments
PDSP_965
Citation
 Kiriyama, MUshikubi, FKobayashi, THirata, MSugimoto, YNarumiya, S Ligand binding specificities of the eight types and subtypes of the mouse prostanoid receptors expressed in Chinese hamster ovary cells. Br J Pharmacol 122:217-24 (1997)  
Target
Name:
Prostacyclin receptor
Synonyms:
PI2R_MOUSE Prostaglandin I Ptgir
Type:
Enzyme Catalytic Domain
Mol. Mass.:
44475.65
Organism:
MOUSE
Description:
Prostaglandin I2 PTGIR MOUSE::P43252
Residue:
415
  
Inhibitor
Name:
BDBM23954
Synonyms:
5-[(2E,3aS,4R,5R,6aS)-5-hydroxy-4-[(1E,3S)-3-hydroxy-4-methyloct-1-en-6-yn-1-yl]-octahydropentalen-2-ylidene]pentanoic acid ILOPROST [3H]-Iloprost
Type:
radiolabeled ligand
Emp. Form.:
C22H32O4
Mol. Mass.:
360.4871
SMILES:
[H][C@]12C[C@@H](O)[C@H](\C=C\[C@@H](O)C(C)CC#CC)[C@@]1([H])C\C(C2)=C\CCCC(O)=O
: