Target
Beta-2 adrenergic receptor
Ligand
BDBM85190
Substrate
Ki
340±n/a nM
Comments
PDSP_1276
Citation
 Johansson, LSohn, DThorberg, SOJackson, DMKelder, DLarsson, LGRényi, LRoss, SBWallsten, CEriksson, HHu, PSJerning, EMohell, NWestlind-Danielsson, A The pharmacological characterization of a novel selective 5-hydroxytryptamine1A receptor antagonist, NAD-299. J Pharmacol Exp Ther 283:216-25 (1997) Target
Name:
Beta-2 adrenergic receptor
Synonyms:
ADRB2_RAT Adrb2r | Adrenergic receptor beta
Type:
PROTEIN
Mol. Mass.:
46896.26
Organism:
Rattus norvegicus
Description:
ChEMBL_38603
Residue:
418
  
Inhibitor
Name:
BDBM85190
Synonyms:
CAS_3055171 NSC_3055171
Type:
Small organic molecule
Emp. Form.:
C18H23FN2O2
Mol. Mass.:
318.3858
SMILES:
NC(=O)c1ccc(F)c2OCC(Cc12)N(C1CCC1)C1CCC1
: