Target
5-hydroxytryptamine receptor 4
Ligand
BDBM50007863
Substrate
Ki
18.62±n/a nM
Comments
PDSP_623
Citation
 Claeysen, SFaye, PSebben, MLemaire, SBockaert, JDumuis, A Cloning and expression of human 5-HT4S receptors. Effect of receptor density on their coupling to adenylyl cyclase. Neuroreport 8:3189-96 (1997)  
Target
Name:
5-hydroxytryptamine receptor 4
Synonyms:
5-HT-4 5-HT4S 5-HT4b 5-HT4d 5-hydroxytryptamine receptor 4 5HT4R_HUMAN Serotonin (5-HT) receptor Serotonin 4 (5-HT4) receptor | Serotonin Receptor 4
Type:
Enzyme
Mol. Mass.:
43767.54
Organism:
Homo sapiens (Human)
Description:
Q13639
Residue:
388
  
Inhibitor
Name:
BDBM50007863
Synonyms:
6-Methoxy-2-oxo-2,3-dihydro-benzoimidazole-1-carboxylic acid 8-methyl-8-aza-bicyclo[3.2.1]oct-3-yl ester; hydrochloride DAU 6285
Type:
Small organic molecule
Emp. Form.:
C17H21N3O4
Mol. Mass.:
331.3663
SMILES:
COc1ccc2[nH]c(=O)n(C(=O)OC3CC4CCC(C3)N4C)c2c1
: