Target
Gamma-aminobutyric acid receptor subunit alpha-6
Ligand
BDBM50000693
Substrate
Ki
>10000±n/a nM
Comments
PDSP_365
Citation
 Ebert, BThompson, SASaounatsou, KMcKernan, RKrogsgaard-Larsen, PWafford, KA Differences in agonist/antagonist binding affinity and receptor transduction using recombinant human gamma-aminobutyric acid type A receptors. Mol Pharmacol 52:1150-6 (1997) Target
Name:
Gamma-aminobutyric acid receptor subunit alpha-6
Synonyms:
GABA A alpha6 GABRA6 | GBRA6_HUMAN
Type:
Enzyme Catalytic Domain
Mol. Mass.:
51029.60
Organism:
Homo sapiens (Human)
Description:
GABA A alpha6 0 HUMAN::Q16445
Residue:
453
  
Inhibitor
Name:
BDBM50000693
Synonyms:
(R)-6-((S)-6-Methyl-5,6,7,8-tetrahydro-[1,3]dioxolo[4,5-g]isoquinolin-5-yl)-6H-furo[3',4':3,4]benzo[1,2-d][1,3]dioxol-8-one (bicuculline) 6-Methyl-5-(8-oxo-6,8-dihydro-furo[3',4':3,4]benzo[1,2-d][1,3]dioxol-6-yl)-5,6,7,8-tetrahydro-[1,3]dioxolo[4,5-g]isoquinolin-6-ium 6-(6-Methyl-5,6,7,8-tetrahydro-[1,3]dioxolo[4,5-g]isoquinolin-5-yl)-6H-furo[3',4':3,4]benzo[1,2-d][1,3]dioxol-8-one (Bicuculline) Bicuculline,(+) bicuculline
Type:
Small organic molecule
Emp. Form.:
C20H17NO6
Mol. Mass.:
367.3521
SMILES:
CN1CCc2cc3OCOc3cc2[C@H]1[C@@H]1OC(=O)c2c1ccc1OCOc21
: