Target
Sodium-dependent dopamine transporter
Ligand
BDBM50069447
Substrate
Ki
360±n/a nM
Comments
PDSP_1303
Citation
 Tatsumi, MGroshan, KBlakely, RDRichelson, E Pharmacological profile of antidepressants and related compounds at human monoamine transporters. Eur J Pharmacol 340:249-58 (1997)  
Target
Name:
Sodium-dependent dopamine transporter
Synonyms:
DA transporter DAT1 Dopamine transporter protein (DAT) SC6A3_HUMAN Sodium-dependent dopamine transporter Solute carrier family 6 member 3
Type:
Multi-pass membrane protein
Mol. Mass.:
68497.11
Organism:
Homo sapiens (Human)
Description:
Q01959
Residue:
620
  
Inhibitor
Name:
BDBM50069447
Synonyms:
1-(3-(4-(m-Chlorophenyl)-1-piperazinyl)propyl)-3-ethyl-4-(2-phenoxyethyl)-delta2-1,2,4-triazolin-5-one CHEMBL623 US9138393, Nefazodone HCl | US9144538, Nefazodone HCl
Type:
Small organic molecule
Emp. Form.:
C25H32ClN5O2
Mol. Mass.:
470.007
SMILES:
CCc1nn(CCCN2CCN(CC2)c2cccc(Cl)c2)c(=O)n1CCOc1ccccc1
: