Target
Sodium-dependent dopamine transporter
Ligand
BDBM50025691
Substrate
Ki
>10000±n/a nM
Comments
PDSP_6531
Citation
 Tatsumi, MGroshan, KBlakely, RDRichelson, E Pharmacological profile of antidepressants and related compounds at human monoamine transporters. Eur J Pharmacol 340:249-58 (1997)  
Target
Name:
Sodium-dependent dopamine transporter
Synonyms:
DA transporter DAT1 Dopamine transporter protein (DAT) SC6A3_HUMAN Sodium-dependent dopamine transporter Solute carrier family 6 member 3
Type:
Multi-pass membrane protein
Mol. Mass.:
68497.11
Organism:
Homo sapiens (Human)
Description:
Q01959
Residue:
620
  
Inhibitor
Name:
BDBM50025691
Synonyms:
2-(2-Ethoxy-phenoxymethyl)-morpholine 2-(2-Ethoxy-phenoxymethyl)-morpholine(viloxazine) VILOXAZINE
Type:
Small organic molecule
Emp. Form.:
C13H19NO3
Mol. Mass.:
237.2949
SMILES:
CCOc1ccccc1OCC1CNCCO1
: