Target
Sodium-dependent noradrenaline transporter
Ligand
BDBM50025691
Substrate
Ki
155±n/a nM
Comments
PDSP_6531
Citation
 Tatsumi, MGroshan, KBlakely, RDRichelson, E Pharmacological profile of antidepressants and related compounds at human monoamine transporters. Eur J Pharmacol 340:249-58 (1997)  
Target
Name:
Sodium-dependent noradrenaline transporter
Synonyms:
Monoamine transporter NET Noradrenaline Transporter (NET) Norepinephrine transporter protein (NET) SLC6A2 Sodium-dependent noradrenaline transporter (NET) | Solute carrier family 6 member 2
Type:
Multi-pass membrane protein
Mol. Mass.:
69337.72
Organism:
Homo sapiens (Human)
Description:
P23975
Residue:
617
  
Inhibitor
Name:
BDBM50025691
Synonyms:
2-(2-Ethoxy-phenoxymethyl)-morpholine 2-(2-Ethoxy-phenoxymethyl)-morpholine(viloxazine) VILOXAZINE
Type:
Small organic molecule
Emp. Form.:
C13H19NO3
Mol. Mass.:
237.2949
SMILES:
CCOc1ccccc1OCC1CNCCO1
: