Target
D(2) dopamine receptor
Ligand
BDBM22871
Substrate
Ki
5.2±n/a nM
Comments
PDSP_1090
Citation
 Seeman, PTallerico, T Antipsychotic drugs which elicit little or no parkinsonism bind more loosely than dopamine to brain D2 receptors, yet occupy high levels of these receptors. Mol Psychiatry 3:123-34 (1998)  
Target
Name:
D(2) dopamine receptor
Synonyms:
D(2) dopamine receptor DOPAMINE D2 Long DRD2 Dopamine D2 receptor Dopamine D2 receptor (D2R) Dopamine2-like | d2
Type:
Cell-surface receptors
Mol. Mass.:
50647.10
Organism:
Homo sapiens (Human)
Description:
P14416
Residue:
443
  
Inhibitor
Name:
BDBM22871
Synonyms:
13-chloro-10-(4-methylpiperazin-1-yl)-2-oxa-9-azatricyclo[9.4.0.0^{3,8}]pentadeca-1(11),3,5,7,9,12,14-heptaene 8-chloro-6-(4-methylpiperazino)benzo[b][1,4]benzoxazepine;succinic acid CL71,563 Loxapine
Type:
Small organic molecule
Emp. Form.:
C18H18ClN3O
Mol. Mass.:
327.808
SMILES:
CN1CCN(CC1)C1=Nc2ccccc2Oc2ccc(Cl)cc12
: