Target
Melatonin receptor type 1A
Ligand
BDBM9019
Substrate
Ki
0.24±n/a nM
Comments
PDSP_1189
Citation
 Beresford, IJBrowning, CStarkey, SJBrown, JFoord, SMCoughlan, JNorth, PCDubocovich, MLHagan, RM GR196429: a nonindolic agonist at high-affinity melatonin receptors. J Pharmacol Exp Ther 285:1239-45 (1998) Target
Name:
Melatonin receptor type 1A
Synonyms:
MTNR1A Melatonin | Melatonin receptor type 1A
Type:
Enzyme Catalytic Domain
Mol. Mass.:
17908.30
Organism:
GUINEA PIG
Description:
Melatonin 0 GUINEA PIG::O02781
Residue:
154
  
Inhibitor
Name:
BDBM9019
Synonyms:
CHEMBL45 N-[2-(5-methoxy-1H-indol-3-yl)ethyl]acetamide
Type:
Small organic molecule
Emp. Form.:
C13H16N2O2
Mol. Mass.:
232.2783
SMILES:
COc1ccc2[nH]cc(CCNC(C)=O)c2c1
: