Target
Prostaglandin G/H synthase 1
Ligand
BDBM22360
Substrate
Ki
4450±n/a nM
Comments
PDSP_3989
Citation
 Cryer, BFeldman, M Cyclooxygenase-1 and cyclooxygenase-2 selectivity of widely used nonsteroidal anti-inflammatory drugs. Am J Med 104:413-21 (1998)  
Target
Name:
Prostaglandin G/H synthase 1
Synonyms:
COX-1 Cyclooxygenase Cyclooxygenase-1 (COX-1) PTGS1 | Prostaglandin G/H synthase (cyclooxygenase)
Type:
Enzyme
Mol. Mass.:
68692.62
Organism:
Homo sapiens (Human)
Description:
P23219
Residue:
599
  
Inhibitor
Name:
BDBM22360
Synonyms:
2-(acetyloxy)benzoate Acetylsalicylic acid Endosprin Zorprin cid_2244
Type:
Anti-Inflammatory Agents, Non-Steroidal
Emp. Form.:
C9H8O4
Mol. Mass.:
180.1574
SMILES:
CC(=O)Oc1ccccc1C(O)=O
: