Target
Kappa-type opioid receptor
Ligand
BDBM50095150
Substrate
Ki
21±n/a nM
Comments
PDSP_780
Citation
 Goldberg, IERossi, GCLetchworth, SRMathis, JPRyan-Moro, JLeventhal, LSu, WEmmel, DBolan, EAPasternak, GW Pharmacological characterization of endomorphin-1 and endomorphin-2 in mouse brain. J Pharmacol Exp Ther 286:1007-13 (1998) Target
Name:
Kappa-type opioid receptor
Synonyms:
K-OR-1 OPIATE Kappa OPRK1 | OPRK_BOVIN
Type:
Enzyme Catalytic Domain
Mol. Mass.:
42629.84
Organism:
CALF
Description:
Q2KIP6
Residue:
380
  
Inhibitor
Name:
BDBM50095150
Synonyms:
(R)-1-[(S)-2-Amino-3-(4-hydroxy-phenyl)-propionyl]-pyrrolidine-2-carboxylic acid [(S)-1-((S)-1-carbamoyl-2-phenyl-ethylcarbamoyl)-2-(1H-indol-3-yl)-ethyl]-amide Endomorphin 1
Type:
Small organic molecule
Emp. Form.:
C34H38N6O5
Mol. Mass.:
610.7027
SMILES:
N[C@@H](Cc1ccc(O)cc1)C(=O)N1CCC[C@@H]1C(=O)N[C@@H](Cc1c[nH]c2ccccc12)C(=O)N[C@@H](Cc1ccccc1)C(N)=O
: