Target
Prostaglandin E2 receptor EP3 subtype
Ligand
BDBM23954
Substrate
Ki
265±n/a nM
Comments
PDSP_965
Citation
 Sharif, NAXu, SXWilliams, GWCrider, JYGriffin, BWDavis, TL Pharmacology of [3H]prostaglandin E1/[3H]prostaglandin E2 and [3H]prostaglandin F2alpha binding to EP3 and FP prostaglandin receptor binding sites in bovine corpus luteum: characterization and correlation with functional data. J Pharmacol Exp Ther 286:1094-102 (1998) Target
Name:
Prostaglandin E2 receptor EP3 subtype
Synonyms:
PE2R3_BOVIN Prostaglandin E3
Type:
Enzyme Catalytic Domain
Mol. Mass.:
46379.75
Organism:
BOVINE
Description:
Prostaglandin E3 PTGER3 BOVINE::P34979
Residue:
417
  
Inhibitor
Name:
BDBM23954
Synonyms:
5-[(2E,3aS,4R,5R,6aS)-5-hydroxy-4-[(1E,3S)-3-hydroxy-4-methyloct-1-en-6-yn-1-yl]-octahydropentalen-2-ylidene]pentanoic acid ILOPROST [3H]-Iloprost
Type:
radiolabeled ligand
Emp. Form.:
C22H32O4
Mol. Mass.:
360.4871
SMILES:
[H][C@]12C[C@@H](O)[C@H](\C=C\[C@@H](O)C(C)CC#CC)[C@@]1([H])C\C(C2)=C\CCCC(O)=O
: