Target
Prostaglandin F2-alpha receptor
Ligand
BDBM82213
Substrate
Ki
2500±n/a nM
Comments
PDSP_1458
Citation
 Sharif, NAXu, SXWilliams, GWCrider, JYGriffin, BWDavis, TL Pharmacology of [3H]prostaglandin E1/[3H]prostaglandin E2 and [3H]prostaglandin F2alpha binding to EP3 and FP prostaglandin receptor binding sites in bovine corpus luteum: characterization and correlation with functional data. J Pharmacol Exp Ther 286:1094-102 (1998) Target
Name:
Prostaglandin F2-alpha receptor
Synonyms:
PF2R_BOVIN PGF2 alpha receptor ProstaglandinF2Alpha | Prostanoid FP receptor
Type:
Enzyme Catalytic Domain
Mol. Mass.:
41044.75
Organism:
BOVINE
Description:
ProstaglandinF2Alpha PTGFR BOVINE::P37289
Residue:
362
  
Inhibitor
Name:
BDBM82213
Synonyms:
CAS_41598-07-6 PGD2
Type:
Small organic molecule
Emp. Form.:
C20H30O4
Mol. Mass.:
334.4498
SMILES:
CCCCCC(O)CC=C1C(CC=CCCCC(O)=O)C=CC1=O
: