Target
Prostaglandin F2-alpha receptor
Ligand
BDBM50020300
Substrate
Ki
119±n/a nM
Comments
PDSP_1467
Citation
 Sharif, NAXu, SXWilliams, GWCrider, JYGriffin, BWDavis, TL Pharmacology of [3H]prostaglandin E1/[3H]prostaglandin E2 and [3H]prostaglandin F2alpha binding to EP3 and FP prostaglandin receptor binding sites in bovine corpus luteum: characterization and correlation with functional data. J Pharmacol Exp Ther 286:1094-102 (1998) Target
Name:
Prostaglandin F2-alpha receptor
Synonyms:
PF2R_BOVIN PGF2 alpha receptor ProstaglandinF2Alpha | Prostanoid FP receptor
Type:
Enzyme Catalytic Domain
Mol. Mass.:
41044.75
Organism:
BOVINE
Description:
ProstaglandinF2Alpha PTGFR BOVINE::P37289
Residue:
362
  
Inhibitor
Name:
BDBM50020300
Synonyms:
(S-isomer)7-[3,5-Dihydroxy-2-(3-hydroxy-oct-1-enyl)-cyclopentyl]-hept-5-enoic acid 7-[3,5-Dihydroxy-2-(3-hydroxy-oct-1-enyl)-cyclopentyl]-hept-5-enoic acid PGF2Alpha | Prostaglandin F2alpha7-[3,5-Dihydroxy-2-(3-hydroxy-oct-1-enyl)-cyclopentyl]-hept-5-enoic acid
Type:
Small organic molecule
Emp. Form.:
C20H34O5
Mol. Mass.:
354.481
SMILES:
CCCCC[C@H](O)\C=C\C1[C@H](O)C[C@H](O)[C@@H]1C\C=C/CCCC(O)=O
: