Target
Galanin receptor type 3
Ligand
BDBM85073
Substrate
Ki
10.47±n/a nM
Comments
PDSP_3166
Citation
 Smith, KEWalker, MWArtymyshyn, RBard, JBorowsky, BTamm, JAYao, WJVaysse, PJBranchek, TAGerald, CJones, KA Cloned human and rat galanin GALR3 receptors. Pharmacology and activation of G-protein inwardly rectifying K+ channels. J Biol Chem 273:23321-6 (1998)  
Target
Name:
Galanin receptor type 3
Synonyms:
GALR3_RAT Galanin receptor type 3 Galr3
Type:
Enzyme Catalytic Domain
Mol. Mass.:
40439.51
Organism:
RAT
Description:
Galanin R3 GALR3 RAT::O88626
Residue:
370
  
Inhibitor
Name:
BDBM85073
Synonyms:
CAS_3043476 NSC_3043476
Type:
Small organic molecule
Emp. Form.:
C23H30N2O3
Mol. Mass.:
382.4959
SMILES:
COc1ccccc1N(CCOc1ccc(C)cc1)C(=O)CN1CCCCC1
: