Target
Neuropeptide Y receptor type 2
Ligand
BDBM82282
Substrate
Ki
0.201±n/a nM
Comments
PDSP_1382
Citation
 Sharma, PHolmberg, SKEriksson, HBeck-Sickinger, AGGrundemar, LLarhammar, D Cloning and functional expression of the guinea pig neuropeptide Y Y2 receptor. Regul Pept 0:23-8 (1998)  
Target
Name:
Neuropeptide Y receptor type 2
Synonyms:
NPY-Y2 NPY2R_CAVPO | Neuropeptide Y receptor type 2
Type:
Enzyme Catalytic Domain
Mol. Mass.:
42344.53
Organism:
GUINEA PIG
Description:
NPY-Y2 NPY2R GUINEA PIG::Q9Z2D5
Residue:
381
  
Inhibitor
Name:
BDBM82282
Synonyms:
NPY13-36 | NPY13-36, porcine
Type:
Small organic molecule
Emp. Form.:
C135H209N41O36
Mol. Mass.:
2982.3571
SMILES:
CC[C@H](C)[C@H](NC(=O)[C@H](Cc1ccc(O)cc1)NC(=O)[C@H](Cc1cnc[nH]1)NC(=O)[C@H](CCCN=C(N)N)NC(=O)[C@H](CC(C)C)NC(=O)[C@H](C)NC(=O)[C@H](CO)NC(=O)[C@H](Cc1ccc(O)cc1)NC(=O)[C@H](Cc1ccc(O)cc1)NC(=O)[C@H](CCCN=C(N)N)NC(=O)[C@H](C)NC(=O)[C@H](CC(C)C)NC(=O)[C@H](CC(O)=O)NC(=O)[C@H](CCC(O)=O)NC(=O)[C@H](C)NC(=O)[C@@H]1CCCN1)C(=O)N[C@@H](CC(N)=O)C(=O)N[C@@H](CC(C)C)C(=O)N[C@@H]([C@@H](C)CC)C(=O)N[C@@H]([C@@H](C)O)C(=O)N[C@@H](CCCN=C(N)N)C(=O)N[C@@H](CCC(N)=O)C(=O)N[C@@H](CCCN=C(N)N)C(=O)N[C@@H](Cc1ccc(O)cc1)C(N)=O
: