Target
Metabotropic glutamate receptor 2
Ligand
BDBM50034503
Substrate
Ki
0.368±n/a nM
Comments
PDSP_2013
Citation
 Mutel, VAdam, GChaboz, SKemp, JAKlingelschmidt, AMesser, JWichmann, JWoltering, TRichards, JG Characterization of (2S,2'R,3'R)-2-(2',3'-[3H]-dicarboxycyclopropyl)glycine binding in rat brain. J Neurochem 71:2558-64 (1998)  
Target
Name:
Metabotropic glutamate receptor 2
Synonyms:
GPRC1B GRM2_HUMAN Metabotropic glutamate receptor mGlu2 | metabotropic glutamate 2
Type:
Enzyme
Mol. Mass.:
95584.88
Organism:
Homo sapiens (Human)
Description:
Q14416
Residue:
872
  
Inhibitor
Name:
BDBM50034503
Synonyms:
(1R,2R)-3-((S)-Amino-carboxy-methyl)-cyclopropane-1,2-dicarboxylic acid (2S,2'R,3'R)-2-(2',3')-dicarboxycyclopropylglycine CHEMBL284193 | DCG-IV
Type:
Small organic molecule
Emp. Form.:
C7H9NO6
Mol. Mass.:
203.1495
SMILES:
N[C@@H](C1[C@H]([C@@H]1C(O)=O)C(O)=O)C(O)=O
: