Target
Muscarinic acetylcholine receptor
Ligand
BDBM50176065
Substrate
Ki
2.04±n/a nM
Comments
PDSP_111
Citation
 Chelala, JLKilani, AMiller, MJMartin, RJErnsberger, P Muscarinic receptor binding sites of the M4 subtype in porcine lung parenchyma. Pharmacol Toxicol 83:200-7 (1998)  
Target
Name:
Muscarinic acetylcholine receptor
Synonyms:
CHRM4 | Cholinergic, muscarinic M4
Type:
Enzyme Catalytic Domain
Mol. Mass.:
50324.85
Organism:
PORCINE
Description:
F1SIA0
Residue:
479
  
Inhibitor
Name:
BDBM50176065
Synonyms:
4-DAMP Acetic acid 4-[(4-acetoxy-phenyl)-pyridin-2-yl-methyl]-phenyl ester CHEMBL76897
Type:
Small organic molecule
Emp. Form.:
C21H26NO2
Mol. Mass.:
324.4361
SMILES:
C[N+]1(C)CCC(CC1)OC(=O)C(c1ccccc1)c1ccccc1
: