Target
Muscarinic acetylcholine receptor M4
Ligand
BDBM81799
Substrate
Ki
32.35±n/a nM
Comments
PDSP_931
Citation
 Chelala, JLKilani, AMiller, MJMartin, RJErnsberger, P Muscarinic receptor binding sites of the M4 subtype in porcine lung parenchyma. Pharmacol Toxicol 83:200-7 (1998)  
Target
Name:
Muscarinic acetylcholine receptor M4
Synonyms:
CHRM4 Cholinergic, muscarinic M4
Type:
Enzyme Catalytic Domain
Mol. Mass.:
30028.84
Organism:
bovine
Description:
A6QQE4
Residue:
271
  
Inhibitor
Name:
BDBM81799
Synonyms:
CAS_98299-40-2 NSC_3602 | hexahydrosiladifenidol
Type:
Small organic molecule
Emp. Form.:
C20H33NOSi
Mol. Mass.:
331.5676
SMILES:
O[Si](CCCN1CCCCC1)(C1CCCCC1)c1ccccc1
: