Target
Galanin receptor type 3
Ligand
BDBM85069
Substrate
Ki
60.26±n/a nM
Comments
PDSP_3188
Citation
 Borowsky, BWalker, MWHuang, LYJones, KASmith, KEBard, JBranchek, TAGerald, C Cloning and characterization of the human galanin GALR2 receptor. Peptides 19:1771-81 (1998)  
Target
Name:
Galanin receptor type 3
Synonyms:
GALNR3 GALR3_HUMAN Galanin receptor 3 | Galanin receptor type 3
Type:
Enzyme Catalytic Domain
Mol. Mass.:
39599.97
Organism:
Homo sapiens (Human)
Description:
Galanin R3 GALR3 HUMAN::O60755
Residue:
368
  
Inhibitor
Name:
BDBM85069
Synonyms:
Galanin (2-29), rat | Galanin Porcine 2-29
Type:
Small organic molecule
Emp. Form.:
C135H201N41O38
Mol. Mass.:
3006.2923
SMILES:
CCC(C)C(NC(=O)C(C)NC(=O)C(Cc1cnc[nH]1)NC(=O)C1CCCN1C(=O)CNC(=O)C(CC(C)C)NC(=O)C(CC(C)C)NC(=O)C(Cc1ccc(O)cc1)NC(=O)CNC(=O)C(C)NC(=O)C(CO)NC(=O)C(CC(N)=O)NC(=O)C(CC(C)C)NC(=O)C(NC(=O)C(N)Cc1c[nH]c2ccccc12)C(C)O)C(=O)NC(CC(O)=O)C(=O)NC(CC(N)=O)C(=O)NC(Cc1cnc[nH]1)C(=O)NC(CCCN=C(N)N)C(=O)NC(CO)C(=O)NC(Cc1ccccc1)C(=O)NC(CO)C(=O)NC(CC(O)=O)C(=O)NC(CCCCN)C(=O)NC(Cc1cnc[nH]1)C(=O)NCC(=O)NC(CC(C)C)C(N)=O
: