Target
Muscarinic acetylcholine receptor M4
Ligand
BDBM50003359
Substrate
Ki
19.95±n/a nM
Comments
PDSP_3206
Citation
 Watson, JBrough, SColdwell, MCGager, THo, MHunter, AJJerman, JMiddlemiss, DNRiley, GJBrown, AM Functional effects of the muscarinic receptor agonist, xanomeline, at 5-HT1 and 5-HT2 receptors. Br J Pharmacol 125:1413-20 (1998)  
Target
Name:
Muscarinic acetylcholine receptor M4
Synonyms:
ACM4_HUMAN Cholinergic, muscarinic M4 Muscarinic acetylcholine receptor M2 and M4
Type:
Enzyme Catalytic Domain
Mol. Mass.:
53079.31
Organism:
Homo sapiens (Human)
Description:
Cholinergic, muscarinic M4 CHRM4 HUMAN M3::P08173
Residue:
479
  
Inhibitor
Name:
BDBM50003359
Synonyms:
5-(4-Hexyloxy-[1,2,5]thiadiazol-3-yl)-1-methyl-1,2,3,6-tetrahydro-pyridine; oxalic acid CHEMBL21536 LY 246708 | Xanomeline
Type:
Small organic molecule
Emp. Form.:
C14H23N3OS
Mol. Mass.:
281.417
SMILES:
CCCCCCOc1nsnc1C1=CCCN(C)C1
: