Target
Opioid receptor delta 1
Ligand
BDBM85395
Substrate
Ki
12±n/a nM
Comments
PDSP_1166
Citation
 McLaughlin, JPHill, KPJiang, QSebastian, AArcher, SBidlack, JM Nitrocinnamoyl and chlorocinnamoyl derivatives of dihydrocodeinone: in vivo and in vitro characterization of mu-selective agonist and antagonist activity. J Pharmacol Exp Ther 289:304-11 (1999) Target
Name:
Opioid receptor delta 1
Synonyms:
Type:
PROTEIN
Mol. Mass.:
40708.41
Organism:
Bos taurus
Description:
ChEMBL_863801
Residue:
372
  
Inhibitor
Name:
BDBM85395
Synonyms:
MC-CAM
Type:
Small organic molecule
Emp. Form.:
C30H31ClN2O4
Mol. Mass.:
519.031
SMILES:
COc1ccc2CC3N(CC4CC4)CCC45[C@@H](Oc1c24)C(=O)CCC35NC(=O)\C=C/c1ccc(Cl)cc1
: