Target
D(1A) dopamine receptor
Ligand
BDBM82247
Substrate
Ki
1.4±n/a nM
Comments
PDSP_1685
Citation
 Bymaster, FPNelson, DLDeLapp, NWFalcone, JFEckols, KTruex, LLForeman, MMLucaites, VLCalligaro, DO Antagonism by olanzapine of dopamine D1, serotonin2, muscarinic, histamine H1 and alpha 1-adrenergic receptors in vitro. Schizophr Res 37:107-22 (1999)  
Target
Name:
D(1A) dopamine receptor
Synonyms:
DOPAMINE D1 Dopamine D1 high Dopamine receptor Dopamine1-like Drd1a
Type:
Enzyme Catalytic Domain
Mol. Mass.:
49429.75
Organism:
RAT
Description:
P18901
Residue:
446
  
Inhibitor
Name:
BDBM82247
Synonyms:
8-Chloro-3-methyl-5-phenyl-2,3,4,5-tetrahydro-1H-benzo[d]azepin-7-ol(SCH 23390) CHEMBL2158641 SCH 23388 SCH 23390 (R-enantiomer) | SCH 23390,R(+)
Type:
Small organic molecule
Emp. Form.:
C17H18ClNO
Mol. Mass.:
287.784
SMILES:
CN1CCc2cc(Cl)c(O)cc2[C@H](C1)c1ccccc1
: