Target
S-adenosylmethionine synthase isoform type-2
Ligand
BDBM85448
Substrate
Meas. Tech.
Inhibition Assay
pH
7.5±0
Temperature
310.15±0 K
Ki
61000±0.0 nM
IC50
100000±0.0 nM
Citation
 Lavrador, KAllart, BGuillerm, DGuillerm, G A new series of S-adenosyl-L-methionine synthetase inhibitors. J Enzym Inhib 13:361-7 (1998)  
Target
Name:
S-adenosylmethionine synthase isoform type-2
Synonyms:
AdoMet synthetase 2 MAT 2 METK2_RAT Methionine adenosyltransferase 2 S-Adenosylmethionine Synthase (AdoMet) S-adenosylmethionine synthetase gamma form | S-adenosylmethionine synthetase isoform type-2
Type:
PROTEIN
Mol. Mass.:
43713.68
Organism:
Rattus norvegicus
Description:
ChEMBL_105118
Residue:
395
  
Inhibitor
Name:
BDBM85448
Synonyms:
Epoxy analogue, I(b)
Type:
Small organic molecule
Emp. Form.:
C6H11NO3
Mol. Mass.:
145.1564
SMILES:
C[C@H]1O[C@H]1C[C@H](N)C(O)=O
: