Target
Prostaglandin G/H synthase 1
Ligand
BDBM50174201
Substrate
Ki
75±n/a nM
Comments
PDSP_3988
Citation
 Warner, TDGiuliano, FVojnovic, IBukasa, AMitchell, JAVane, JR Nonsteroid drug selectivities for cyclo-oxygenase-1 rather than cyclo-oxygenase-2 are associated with human gastrointestinal toxicity: a full in vitro analysis. Proc Natl Acad Sci U S A 96:7563-8 (1999)  
Target
Name:
Prostaglandin G/H synthase 1
Synonyms:
COX-1 Cyclooxygenase Cyclooxygenase-1 (COX-1) PTGS1 | Prostaglandin G/H synthase (cyclooxygenase)
Type:
Enzyme
Mol. Mass.:
68692.62
Organism:
Homo sapiens (Human)
Description:
P23219
Residue:
599
  
Inhibitor
Name:
BDBM50174201
Synonyms:
ARTHROTEC SOLARAZE US11173137, Compound Diclofenac VOLTAREN-XR sodium 2-(2-(2,6-dichlorophenylamino)phenyl)acetate
Type:
Small organic molecule
Emp. Form.:
C14H10Cl2NO2
Mol. Mass.:
295.141
SMILES:
[O-]C(=O)Cc1ccccc1Nc1c(Cl)cccc1Cl
: