Target
Sodium-dependent serotonin transporter
Ligand
BDBM50048392
Substrate
Ki
>10000±n/a nM
Comments
PDSP_444
Citation
 Sánchez, CHyttel, J Comparison of the effects of antidepressants and their metabolites on reuptake of biogenic amines and on receptor binding. Cell Mol Neurobiol 19:467-89 (1999)  
Target
Name:
Sodium-dependent serotonin transporter
Synonyms:
5-HT Transporter 5HT transporter Anandamid membrane transporter, AMT Monoamine transporters; Norepinephrine & serotonin Slc6a4 Sodium-dependent serotonin transporter (SERT) | imipramine receptor
Type:
Multi-pass membrane protein
Mol. Mass.:
70168.43
Organism:
Rattus norvegicus (rat)
Description:
P31652
Residue:
630
  
Inhibitor
Name:
BDBM50048392
Synonyms:
2-(tert-butylamino)-1-(3-chlorophenyl)propan-1-one BUPROPION HYDROCHLORIDE US9944618, Compound ID No. 176
Type:
Small organic molecule
Emp. Form.:
C13H18ClNO
Mol. Mass.:
239.741
SMILES:
CC(NC(C)(C)C)C(=O)c1cccc(Cl)c1
: